{"text_format":"1","workbook":"xlsx","n_sheets":11,"sheets":["README","ReleaseNotes","unique_contracts","Calcs","resources","lse_names","misc","btm_pv_forecast","CSPReportSheet","Reliability","ReportSheet"],"not_rendered":{"charts":2,"images":0,"macros":1,"external_links":0,"defined_names":62,"comments":0,"pivot_tables":0},"unopened":[],"bounds":{"document_bytes":16777216,"sheet_cells":100000,"rows_first":2000,"rows_last":500,"rows_between":2000,"halvings":0,"cell_chars":16384,"cell_head_chars":4096},"cells_cut":0,"cells_raw":0,"read":"whole","date_system":"1900"}

{"sheet":"README","index":0,"n_rows":4,"n_cols":4,"rows_kept":4,"cut":false,"hidden":false,"merged":[[3,0,3,1],[3,3,4,6]]}
["ReleaseVersion","rdtv3"]
["ReleaseDate","2022-09-23"]
[]
[null,null,null," In order to run the macro, LSEs must FIRST enable macros. Then, they are instructed to complete the RDT data entry fully, then push the button on the README tab. "]

{"sheet":"ReleaseNotes","index":1,"n_rows":9,"n_cols":4,"rows_kept":9,"cut":false,"hidden":false,"merged":[]}
["ReleaseVersion","ReleaseDate","ID","Note"]
["RDTv3 beta","2022-06-06"]
["RDTv3 Release","2022-06-15"]
["RDTv3 Updated","2022-06-20",null,"Minor updates in columns' names"]
["RDTv3 Updated","2022-07-15",null,"Reliability tabs updates & some minor updates to the resource tab"]
["RDTv3 Updated","2022-07-29",null,"1)\"misc\" tab: updated with all ELCC % values and added MRN/TRN ratios\n2)“Reliability” tab: added formulas to pull MRN/TRN ratios from the “misc” worksheet; updated formatting for cells H23:J50 and L23:P50 (previously greyed out since results weren’t available for those years)\n3)“Calcs” tab: updated formulas in columns S:T so that battery contracts with durations greater than or equal to 9 hours will get “8hr_batteries” ELCC%; updated formulas in columns S:T and added formulas in column Y so that battery contracts with durations less than 4 hours will get (“4hr_batteries” ELCC%) * (contract duration) / 4hr"]
{"$rows_left_out":4}
{"sheet":"unique_contracts","index":2,"n_rows":53,"n_cols":77,"rows_kept":53,"cut":false,"hidden":false,"merged":[]}
["lse_unique_contract_id","resource","alternative_resource_name","contract_status","project_interconnection_position","interconnection_substation","marginal_addition","marginal_addition_to","total_nameplate_capacity","contracted_nameplate_capacity","sep_contracted_mw_nqc","contract_gwh_annual","is_hybrid_paired","can_charge_from_grid","total_generator_mw","contracted_generator_mw","total_storage_mw","contracted_storage_mw","solar_technology_sub_type","storage_technology_sub_type","total_storage_depth_mwh","contracted_storage_depth_mwh","viability_cod_reasonableness","viability_technical_feasibility","viability_financing_sitecontrol","resource_mix","cam_d1911016_vamo_ghgfreepcia","buy_sell_own","counterparty","generator_supplier","developer_name","capacity_area","capacity_sub_area","cpuc_approval_ref","county","COD_year","COD_month","COD_day","contract_start_date_year","contract_start_date_month","contract_start_date_day","contract_end_date_year","contract_end_date_month","contract_end_date_day","contract_execution_date_year","contract_execution_date_month","contract_execution_date_day","tx_upgrades","tx_upgrade_date_year","tx_upgrade_date_month","tx_upgrade_date_day","tx_upgrade_description","d1911016_tranche","d2106035_procurement_cat","mtr_tranche1_NQC","mtr_tranche2_NQC","mtr_tranche3_NQC","mtr_tranche4_NQC_LDES","mtr_tranche4_NQC_firm_ZE","mtr_NQC_ZE_gen_paired_dr","previous_COD_year","previous_COD_month","previous_COD_day","remediation_plan","signed_contract","notice_to_proceed","public_contract","buying_energy_capacity","NQC_reporting_source","procurement_origin","csp_resource_category","csp_annual_2024","csp_annual_2026","csp_annual_2030","csp_annual_2035","macro_supertype","notes"]
["UC_RAONLY_RCEA_2","_NEW_GENERIC_SOLAR_1AXIS","Sandrini Sol 1 Solar Park","Development","Q-1213","NA","NA",null,null,null,null,null,"NotHybrid",null,null,null,null,null,"1Axis",null,null,null,null,null,null,null,"D.19-11-016","Buy","Redwood Coast Energy Authority","EDPR North America","NA","Kern",null,null,"KernCounty",null,null,null,null,null,null,null,null,null,null,null,null,null,null,null,null,null,3,null,null,null,null,null,null,null,null,null,null,"NO","YES","YES",null,"CapacityOnly","In the contract","D1911016","NA",null,null,null,null,"newgeneric"]
["UC_PPA_GoldenFields_1","_NEW_GENERIC_SOLAR_1AXIS",null,"Development","Q-1212","NA","NA",null,null,null,null,null,"NotHybrid",null,null,null,null,null,"1Axis",null,null,null,null,null,null,null,null,"Buy","non-LSE supplier","Golden_Fields_Solar_IV_LLC","NA","Kern",null,null,"KernCounty",null,null,null,null,null,null,null,null,null,null,null,null,null,null,null,null,null,null,null,null,null,null,null,null,null,null,null,null,"NA","YES",null,null,"EnergyCapacity","Calculated",null,"Solar New SCE SDG&E (GWh)",null,null,null,null,"newgeneric"]
[null,"_NEW_GENERIC_BATTERY_STORAGE",null,"Development","Q-1212","NA","NA",null,null,null,null,null,"NotHybrid",null,null,null,null,null,null,"Li",120,null,null,null,null,null,null,"Buy","non-LSE supplier",null,"NA","Kern",null,null,"KernCounty",null,null,null,null,null,null,null,null,null,null,null,null,null,null,null,null,null,null,null,null,null,null,null,null,null,null,null,null,"NA","NO",null,null,"EnergyCapacity","Calculated",null,"Battery Storage (MWh Energy Capacity)",null,null,null,null,"newgeneric"]
["PGE_Development_battery_1","_NEW_GENERIC_BATTERY_STORAGE",null,"Development",null,null,null,null,null,null,null,null,"NotHybrid",null,null,null,null,null,null,"Li",null,null,null,null,null,null,"CAM","Buy","Pacific Gas & Electric",null,null,null,null,null,null,null,null,null,null,null,null,null,null,null,null,null,null,null,null,null,null,null,null,null,null,null,null,null,null,null,null,null,null,null,null,null,null,"CapacityOnly",null,null,"Battery Storage (MWh Energy Capacity)",null,null,null,null,"newgeneric"]
["PGE_Development_battery_2","_NEW_GENERIC_BATTERY_STORAGE",null,"Development",null,null,null,null,null,null,null,null,"NotHybrid",null,null,null,null,null,null,"Li",null,null,null,null,null,null,"CAM","Buy","Pacific Gas & Electric",null,null,null,null,null,null,null,null,null,null,null,null,null,null,null,null,null,null,null,null,null,null,null,null,null,null,null,null,null,null,null,null,null,null,null,null,null,null,"EnergyCapacity",null,null,"Battery Storage (MWh Energy Capacity)",null,null,null,null,"newgeneric"]
{"$rows_left_out":48}
{"sheet":"Calcs","index":3,"n_rows":1,"n_cols":37,"rows_kept":1,"cut":false,"hidden":false,"merged":[[0,0,20,0]]}
["Instruction: This worksheet consists of formulas only. LSEs should extend formulas in columns B:AK to cover all contracts entered in the \"unique_contracts\" worksheet (i.e. the last row that has formulas in this worksheet should have a row number that is greater than or equal to that of the last row in the \"unique_contracts\" worksheet). To extend formulas in this worksheet, please select one row (e.g. B500:AK500) and drag down the formulas vertically. PLEASE DO NOT DRAG FORMULAS HORIZONTALLY. Please do not hard-code values in this worksheet. All contract information should be entered in the \"unique_contracts\" tab.","resource","contract_status","contracted_nameplate_capacity","is_hybrid_paired","can_charge_from_grid","contracted_generator_mw","contracted_storage_mw","contracted_storage_depth_mwh","buy_sell_own","contract_start_date_year","contract_start_date_month","contract_start_date_day","contract_end_date_year","contract_end_date_month","contract_end_date_day","buying_energy_capacity","multiplier","resource elcc type","hybrid/paired storage elcc type","elcc type (for summary tables and charts)","start year","end year","hybrid storage derate (100% means no derates)","short duration derate",2024,2025,2026,2027,2028,2029,2030,2031,2032,2033,2034,2035]

{"sheet":"resources","index":4,"n_rows":1778,"n_cols":7,"rows_kept":1778,"cut":false,"hidden":false,"merged":[]}
["resource","generator_name","MAXGEN","resolve_final_group","BAA_ID","supertype","elcc_type"]
["7STDRD_1_SOLAR1","SHAFTER_SOLAR",20,"caiso_solar","CISO","physical","utility_pv"]
["ACACIA_6_SOLAR","WEST_ANTELOPE_SOLAR",20,"caiso_solar","CISO","physical","utility_pv"]
["ADELANTO_SOLAR","NAN",10,"ldwp_solar","LADWP","physical","utility_pv"]
["ADERA_1_SOLAR1","ADERA_SOLAR",20,"caiso_solar","CISO","physical","utility_pv"]
["ADLIN_1_UNITS","GEYSERS_AIDLIN_AGGREGATE",22,"caiso_geothermal","CISO","physical","geothermal"]
{"$rows_left_out":1773}
{"sheet":"lse_names","index":5,"n_rows":104,"n_cols":3,"rows_kept":104,"cut":false,"hidden":false,"merged":[]}
["lse","NAME","lse_type"]
["3PR","3 Phases Renewables","ESP"]
["APN","American PowerNet Management","ESP"]
["AVCE","Apple Valley Choice Energy","CCA"]
["CEI","Just Energy Solutions","ESP"]
["CES","Commercial Energy of Montana","ESP"]
{"$rows_left_out":99}
{"sheet":"misc","index":6,"n_rows":93,"n_cols":74,"rows_kept":93,"cut":false,"hidden":false,"merged":[]}
["contract_status","bool","yes_no","Year","int_count","transact","cap_areas","cap_sub_areas","state_county","d1911016_tranches","d2106035_tranche ","energy_capacity_from_resource","is_hybrid_paired","csp_cat","solar_Technology_sub_type","storage_Technology_sub_type","nqc_reporting_source","cam_d1911016_vamo_pcia",null,"25MMT ELCC (%)",null,null,null,null,null,null,null,null,null,null,null,null,null,"30MMT ELCC (%)",null,null,null,null,null,null,null,null,null,null,null,null,null,"25MMT MRN/TRN ratio",null,null,null,null,null,null,null,null,null,null,null,null,null,"30MMT MRN/TRN ratio"]
["Online",0,"YES","NA","NA","Buy","Humboldt","North Coast  Eagle Rock","NA","NA","NA","EnergyCapacity","NotHybrid","NA","Fixed","Li","In the contract","CAM",null,"elcc_type",2024,2025,2026,2027,2028,2029,2030,2031,2032,2033,2034,2035,null,"elcc_type",2024,2025,2026,2027,2028,2029,2030,2031,2032,2033,2034,2035,null,null,2024,2025,2026,2027,2028,2029,2030,2031,2032,2033,2034,2035,null,null,2024,2025,2026,2027,2028,2029,2030,2031,2032,2033,2034,2035]
["Review",1,"NO",1970,1,"Sell","NorthCoastNorthBay","North Coast  Fulton","AlpineCounty",1,"firm_ZE","EnergyOnly","ExistingBiomassExistingStorage","Large Hydro (GWh)","SolarThermal","Flow","Calculated","D.19-11-016",null,"in_state_wind_south",0.11841355076102321,0.13636070685128646,0.15430786294154972,0.10693659222396304,5.9565321506376369E-2,7.7201442724824779E-2,9.4837563943273195E-2,8.4644753263379724E-2,7.4451942583486252E-2,6.4259131903592781E-2,5.406632122369931E-2,4.3873510543805838E-2,null,"in_state_wind_south",0.15102941403529452,0.15178846902809942,0.15254752402090432,0.11848326121551586,8.4418998410127413E-2,8.3416882718990337E-2,8.2414767027853275E-2,7.4829691124404837E-2,6.72446152209564E-2,5.9659539317507955E-2,5.207446341405951E-2,4.4489387510611059E-2,null,null,0.77201871279722722,0.78867470616438251,0.80390270140610376,0.77610409059689334,0.75027694884377893,0.76246521023924085,0.77457060149091872,0.74274625791973614,0.71261162813758272,0.6827328847380274,0.65390251423413703,0.62577079443506212,null,null,0.80029848011116889,0.81896333891271367,0.83611438362607471,0.79544567238840358,0.75709177033813169,0.73673303550177849,0.71703757483484865,0.69918925792169562,0.68264892770624752,0.66607760402249072,0.65025016398978508,0.63484459547384975]
["PlannedExisting",null,"NA",1971,2,"Owned","Sierra","Sierra  Placer","AmadorCounty","1&2","firm_ZE_&_firm_ZE_ext","CapacityOnly","ExistingBiomassNewStorage","Imported Hydro (GWh)","1Axis","PSH",null,"VAMO",null,"in_state_wind_north",0.23682710152204642,0.27272141370257291,0.30861572588309943,0.21387318444792608,0.11913064301275274,0.15440288544964956,0.18967512788654639,0.16928950652675945,0.1489038851669725,0.12851826380718556,0.10813264244739862,8.7747021087611676E-2,null,"in_state_wind_north",0.30205882807058904,0.30357693805619884,0.30509504804180865,0.23696652243103172,0.16883799682025483,0.16683376543798067,0.16482953405570655,0.14965938224880967,0.1344892304419128,0.11931907863501591,0.10414892682811902,8.8978775021222117E-2]
["Development",null,null,1972,3,null,"Stockton","Sierra  Pease","AlamedaCounty",2,"firm_ZE_ext",null,"ExistingGeothermalExistingStorage","Asset Controlling Supplier (GWh)","2Axis","Other",null,"GHG-free PCIA",null,"out_of_state_wind_WYID",0.46897827577694978,0.45359083280372914,0.43820338983050844,0.38080451179552754,0.3234056337605466,0.32954852469028811,0.33569141562002963,0.32866160707229491,0.3216317985245602,0.31460198997682548,0.30757218142909076,0.30054237288135593,null,"out_of_state_wind_WYID",0.42559322033898306,0.39180370915668034,0.35801419797437761,0.37372282962154058,0.38943146126870348,0.31241064588858902,0.23538983050847456,0.24842033898305083,0.26145084745762709,0.27448135593220335,0.28751186440677962,0.30054237288135593]
["PlannedNew",null,null,1973,4,null,"GreaterBay","Sierra  Gold Hill-Drum","ButteCounty","2&3","general",null,"ExistingGeothermalNewStorage","Nuclear (GWh)",null,null,null,null,null,"out_of_state_wind_WAOR",0.28743829805684018,0.27800728462164043,0.26857627118644067,0.23339631368112979,0.19821635617581887,0.20198135384243465,0.20574635150905043,0.20143775917334206,0.19712916683763368,0.1928205745019253,0.18851198216621692,0.18420338983050849,null,"out_of_state_wind_WAOR",0.26084745762711864,0.24013775722506214,0.21942805682300565,0.22905592783255713,0.23868379884210861,0.1914774926413933,0.14427118644067796,0.15225762711864407,0.16024406779661018,0.1682305084745763,0.17621694915254241,0.18420338983050849]
{"$rows_left_out":88}
{"sheet":"btm_pv_forecast","index":7,"n_rows":43,"n_cols":17,"rows_kept":43,"cut":false,"hidden":false,"merged":[]}
[]
[null,null,null,null,null,"Capacity (MW)"]
[null,"Service Area","Type","LSE CPUC ID","LSE Name",2024,2025,2026,2027,2028,2029,2030,2031,2032,2033,2034,2035]
[]
[null,"PGE","IOU","PGE","Pacific Gas and Electric (Bundled)",2483.8068589790723,2670.6038103689802,2858.9074246620553,3056.0035900636071,3256.6374079561342,3468.7628407033926,3666.9481221821034,3882.9316452981288,4089.8779554219054,4313.371000375545,4525.9710006049063,4733.5943482356379]
[null,"PGE","ESP",null,"Pacific Gas and Electric (Direct Access)",1044.2812727718472,1116.2856772500425,1188.7877162783418,1263.803082966863,1341.8643229155455,1417.5187133768627,1491.0134772441515,1560.1180533957549,1628.5101143427687,1691.9805408676923,1751.8540669200165,1806.595437887127]
{"$rows_left_out":38}
{"sheet":"CSPReportSheet","index":8,"n_rows":38,"n_cols":22,"rows_kept":38,"cut":false,"hidden":false,"merged":[[2,10,2,13],[2,14,2,17],[2,18,2,21],[1,10,1,21]]}
[]
[null,null,null,null,null,null,null,null,null,null,"NOTE: the below data is provided for troubleshooting purposes only."]
[null,null,null,null,null,null,null,null,null,null,"Bought/Owned",null,null,null,"Sold",null,null,null,"Net\n(GWh, MW, or MWh Energy Capacity)"]
[null,"Resource",2024,2026,2030,2035,"Units","Type",null,null,2024,2026,2030,2035,2024,2026,2030,2035,2024,2026,2030,2035]
[null,"Large Hydro",{"$f":"S5","v":9.7913999999999994},{"$f":"T5","v":14.6914},14.6914,14.6914,"GWh","GHG-Free",null,null,{"$f":"SUM(SUMIFS(unique_contracts!BT:BT,unique_contracts!$AB:$AB,{\"Buy\",\"Owned\"},unique_contracts!$BS:$BS,\"=\"&$B5&\" (\"&$G5&\")\",unique_contracts!$AM:$AM,\"<=\"&C$4,unique_contracts!$AP:$AP,\">=\"&C$4), SUMIFS(unique_contracts!BT:BT,unique_contracts!$AB:$AB,\"=\"&\"\",unique_contracts!$BS:$BS,\"=\"&$B5&\" (\"&$G5&\")\",unique_contracts!$AM:$AM,\"<=\"&C$4,unique_contracts!$AP:$AP,\">=\"&C$4))","v":9.7913999999999994},{"$f":"SUM(SUMIFS(unique_contracts!BU:BU,unique_contracts!$AB:$AB,{\"Buy\",\"Owned\"},unique_contracts!$BS:$BS,\"=\"&$B5&\" (\"&$G5&\")\",unique_contracts!$AM:$AM,\"<=\"&D$4,unique_contracts!$AP:$AP,\">=\"&D$4), SUMIFS(unique_contracts!BU:BU,unique_contracts!$AB:$AB,\"=\"&\"\",unique_contracts!$BS:$BS,\"=\"&$B5&\" (\"&$G5&\")\",unique_contracts!$AM:$AM,\"<=\"&D$4,unique_contracts!$AP:$AP,\">=\"&D$4))","v":14.6914},{"$f":"SUM(SUMIFS(unique_contracts!BV:BV,unique_contracts!$AB:$AB,{\"Buy\",\"Owned\"},unique_contracts!$BS:$BS,\"=\"&$B5&\" (\"&$G5&\")\",unique_contracts!$AM:$AM,\"<=\"&E$4,unique_contracts!$AP:$AP,\">=\"&E$4), SUMIFS(unique_contracts!BV:BV,unique_contracts!$AB:$AB,\"=\"&\"\",unique_contracts!$BS:$BS,\"=\"&$B5&\" (\"&$G5&\")\",unique_contracts!$AM:$AM,\"<=\"&E$4,unique_contracts!$AP:$AP,\">=\"&E$4))","v":14.6914},{"$f":"SUM(SUMIFS(unique_contracts!BW:BW,unique_contracts!$AB:$AB,{\"Buy\",\"Owned\"},unique_contracts!$BS:$BS,\"=\"&$B5&\" (\"&$G5&\")\",unique_contracts!$AM:$AM,\"<=\"&F$4,unique_contracts!$AP:$AP,\">=\"&F$4), SUMIFS(unique_contracts!BW:BW,unique_contracts!$AB:$AB,\"=\"&\"\",unique_contracts!$BS:$BS,\"=\"&$B5&\" (\"&$G5&\")\",unique_contracts!$AM:$AM,\"<=\"&F$4,unique_contracts!$AP:$AP,\">=\"&F$4))","v":14.6914},{"$f":"SUMIFS(unique_contracts!BT:BT,unique_contracts!$AB:$AB,\"=Sell\",unique_contracts!$BS:$BS,\"=\"&$B5&\" (\"&$G5&\")\",unique_contracts!$AM:$AM,\"<=\"&C$4,unique_contracts!$AP:$AP,\">=\"&C$4)","v":0},{"$f":"SUMIFS(unique_contracts!BU:BU,unique_contracts!$AB:$AB,\"=Sell\",unique_contracts!$BS:$BS,\"=\"&$B5&\" (\"&$G5&\")\",unique_contracts!$AM:$AM,\"<=\"&D$4,unique_contracts!$AP:$AP,\">=\"&D$4)","v":0},{"$f":"SUMIFS(unique_contracts!BV:BV,unique_contracts!$AB:$AB,\"=Sell\",unique_contracts!$BS:$BS,\"=\"&$B5&\" (\"&$G5&\")\",unique_contracts!$AM:$AM,\"<=\"&E$4,unique_contracts!$AP:$AP,\">=\"&E$4)","v":0},{"$f":"SUMIFS(unique_contracts!BW:BW,unique_contracts!$AB:$AB,\"=Sell\",unique_contracts!$BS:$BS,\"=\"&$B5&\" (\"&$G5&\")\",unique_contracts!$AM:$AM,\"<=\"&F$4,unique_contracts!$AP:$AP,\">=\"&F$4)","v":0},{"$f":"K5-O5","v":9.7913999999999994},{"$f":"L5-P5","v":14.6914},14.6914,14.6914]
[null,"Imported Hydro",{"$f":"S6","v":0},{"$f":"T6","v":0},0,0,"GWh","GHG-Free",null,null,{"$f":"SUM(SUMIFS(unique_contracts!BT:BT,unique_contracts!$AB:$AB,{\"Buy\",\"Owned\"},unique_contracts!$BS:$BS,\"=\"&$B6&\" (\"&$G6&\")\",unique_contracts!$AM:$AM,\"<=\"&C$4,unique_contracts!$AP:$AP,\">=\"&C$4), SUMIFS(unique_contracts!BT:BT,unique_contracts!$AB:$AB,\"=\"&\"\",unique_contracts!$BS:$BS,\"=\"&$B6&\" (\"&$G6&\")\",unique_contracts!$AM:$AM,\"<=\"&C$4,unique_contracts!$AP:$AP,\">=\"&C$4))","v":0},{"$f":"SUM(SUMIFS(unique_contracts!BU:BU,unique_contracts!$AB:$AB,{\"Buy\",\"Owned\"},unique_contracts!$BS:$BS,\"=\"&$B6&\" (\"&$G6&\")\",unique_contracts!$AM:$AM,\"<=\"&D$4,unique_contracts!$AP:$AP,\">=\"&D$4), SUMIFS(unique_contracts!BU:BU,unique_contracts!$AB:$AB,\"=\"&\"\",unique_contracts!$BS:$BS,\"=\"&$B6&\" (\"&$G6&\")\",unique_contracts!$AM:$AM,\"<=\"&D$4,unique_contracts!$AP:$AP,\">=\"&D$4))","v":0},{"$f":"SUM(SUMIFS(unique_contracts!BV:BV,unique_contracts!$AB:$AB,{\"Buy\",\"Owned\"},unique_contracts!$BS:$BS,\"=\"&$B6&\" (\"&$G6&\")\",unique_contracts!$AM:$AM,\"<=\"&E$4,unique_contracts!$AP:$AP,\">=\"&E$4), SUMIFS(unique_contracts!BV:BV,unique_contracts!$AB:$AB,\"=\"&\"\",unique_contracts!$BS:$BS,\"=\"&$B6&\" (\"&$G6&\")\",unique_contracts!$AM:$AM,\"<=\"&E$4,unique_contracts!$AP:$AP,\">=\"&E$4))","v":0},{"$f":"SUM(SUMIFS(unique_contracts!BW:BW,unique_contracts!$AB:$AB,{\"Buy\",\"Owned\"},unique_contracts!$BS:$BS,\"=\"&$B6&\" (\"&$G6&\")\",unique_contracts!$AM:$AM,\"<=\"&F$4,unique_contracts!$AP:$AP,\">=\"&F$4), SUMIFS(unique_contracts!BW:BW,unique_contracts!$AB:$AB,\"=\"&\"\",unique_contracts!$BS:$BS,\"=\"&$B6&\" (\"&$G6&\")\",unique_contracts!$AM:$AM,\"<=\"&F$4,unique_contracts!$AP:$AP,\">=\"&F$4))","v":0},{"$f":"SUMIFS(unique_contracts!BT:BT,unique_contracts!$AB:$AB,\"=Sell\",unique_contracts!$BS:$BS,\"=\"&$B6&\" (\"&$G6&\")\",unique_contracts!$AM:$AM,\"<=\"&C$4,unique_contracts!$AP:$AP,\">=\"&C$4)","v":0},{"$f":"SUMIFS(unique_contracts!BU:BU,unique_contracts!$AB:$AB,\"=Sell\",unique_contracts!$BS:$BS,\"=\"&$B6&\" (\"&$G6&\")\",unique_contracts!$AM:$AM,\"<=\"&D$4,unique_contracts!$AP:$AP,\">=\"&D$4)","v":0},{"$f":"SUMIFS(unique_contracts!BV:BV,unique_contracts!$AB:$AB,\"=Sell\",unique_contracts!$BS:$BS,\"=\"&$B6&\" (\"&$G6&\")\",unique_contracts!$AM:$AM,\"<=\"&E$4,unique_contracts!$AP:$AP,\">=\"&E$4)","v":0},{"$f":"SUMIFS(unique_contracts!BW:BW,unique_contracts!$AB:$AB,\"=Sell\",unique_contracts!$BS:$BS,\"=\"&$B6&\" (\"&$G6&\")\",unique_contracts!$AM:$AM,\"<=\"&F$4,unique_contracts!$AP:$AP,\">=\"&F$4)","v":0},{"$f":"K6-O6","v":0},{"$f":"L6-P6","v":0},{"$f":"M6-Q6","v":0},{"$f":"N6-R6","v":0}]
{"$rows_left_out":33}
{"sheet":"Reliability","index":9,"n_rows":257,"n_cols":16,"rows_kept":257,"cut":false,"hidden":false,"merged":[]}
["LSE Input"]
[null,null,30,"MMT"]
[]
[]
[null,null,"Reliability Need"]
[null,null,null,null,2024,2025,2026,2027,2028,2029,2030,2031,2032,2033,2034,2035]
{"$rows_left_out":252}
{"sheet":"ReportSheet","index":10,"n_rows":8,"n_cols":11,"rows_kept":8,"cut":false,"hidden":false,"merged":[]}
["Duplicated Contract IDs:","Entry with non-positive values:","Invalid resource error rows:","Rows missing required project viability associated data:","Rows missing required hybrid associated data:","Supertype Contract Status Error or Null Rows:","Transaction counterparty error rows:","Rows missing CSP GWh:","Rows with invalid buying_energy_capacity and csp_resource_category:","Rows missing MTR NQC:","Warning-total capacity is equal to or greater then generator plus storage MWs for rows:"]
[null,null,null,29,41]
[null,null,null,30,42]
[null,null,null,32]
[null,null,null,33]
[null,null,null,45]
{"$rows_left_out":2}