{"text_format":"1","workbook":"xlsx","n_sheets":8,"sheets":["Intro","Scales","Assess","Assess2","Lists","Chart","ChartData","Export"],"not_rendered":{"charts":1,"images":6,"macros":1,"external_links":1,"defined_names":16,"comments":0,"pivot_tables":0},"unopened":[],"bounds":{"document_bytes":16777216,"sheet_cells":100000,"rows_first":2000,"rows_last":500,"rows_between":2000,"halvings":0,"cell_chars":16384,"cell_head_chars":4096},"cells_cut":0,"cells_raw":0,"read":"whole","date_system":"1900"}

{"sheet":"Intro","index":0,"n_rows":28,"n_cols":14,"rows_kept":28,"cut":false,"hidden":false,"merged":[[27,1,28,2],[3,1,25,9],[1,1,2,13],[3,11,3,13],[5,11,7,12],[26,4,29,6]]}
[]
[null,"Summary Higher Education Risk Assessment"]
[]
[null,"Welcome to the Summary Higher Education Risk Assessment workbook.   This workbook will help you consider your campus' risk portfolio for a specified list of the most common risks in Higher Education.  This workbook will not make decisions for you, but it will help you organize your thinking as you consider your campus' risk profile and related enterprise risk managment implications. \n\nIdentify the following for each set of objectives and identified risks:\n■ Estimated impact and likelihood of each identified risk by objective type\n■ Controls used to mitigate identified risks\n■ Frequency and effectiveness of the compensating controls\n■ Strategies used to monitor control activities, such as reports and dashboards\n■ Individual/department(s) responsible for executing the strategies identified\n\nBefore you begin, please complete the identifying information at the top of this page and save this workbook in a secure location with an appropriate, unique name. This will minimize confusion if multiple workbooks are completed. Use the button below to get started. Also, be sure to document the scale parameters used completing this workbook on the tab provided. When you have completed the worksheet, you may export the data into a new workbook and save your information in comma separated value file (.csv) for use in the University's Enterprise Risk Management Information System (ERMIS) by coming back to this page and selecting the \"Export\" button when you're done.",null,null,null,null,null,null,null,null,null,"Project Information"]
[null,null,null,null,null,null,null,null,null,null,null,null,"Project Name:","Ines Detomana"]
[null,null,null,null,null,null,null,null,null,null,null,"Names and titles of person(s) completing this workbook:"]
{"$rows_left_out":23}
{"sheet":"Scales","index":1,"n_rows":30,"n_cols":7,"rows_kept":30,"cut":false,"hidden":false,"merged":[[2,4,2,5],[11,4,11,5],[20,4,20,5],[0,1,1,2]]}
[null,"Setting Common Parameters"]
[]
[null,null,null,null,"Risk Impact"]
[null,null,null,null,"Scale","Definition"]
[null,null,null,null,"Very high","Loss of multiple lives;  extensive permanent disabling injuries or illness requiring evacuation; long-term incarceration or denial of freedom; Losses greater than $100,000; Public embarrassment, high wide-spread news profile, third party actions; Loss of accreditation; Termination of program; Loss of demand for services",15]
[null,null,null,null,"High","Loss of a life;  major injuries or illness requiring hospitalization; short-term incarceration or denial of freedom; Losses between $50,000 and $100,000; Public embarrassment, high news profile, third party actions; Probation by accrediting agency; Disruption of program up to 1 month; Major decline in demand for services",12]
{"$rows_left_out":25}
{"sheet":"Assess","index":2,"n_rows":53,"n_cols":16,"rows_kept":53,"cut":false,"hidden":false,"merged":[[7,1,7,2],[2,1,5,2]]}
[]
[null,"Instructions:"]
[null,"Please review the list of risks below and consider the estimated impact and likelihood for each event, taking into consideration the potential impact on the strategic, financial, operational, compliance, reputational and reporting goals of your organization."]
[]
[]
[]
{"$rows_left_out":48}
{"sheet":"Assess2","index":3,"n_rows":53,"n_cols":17,"rows_kept":53,"cut":false,"hidden":false,"merged":[[7,1,7,2],[2,1,5,3]]}
[]
[null,"Instructions:"]
[null,"Please note additional controls needed to reduce risks to an acceptable level.  In the next column, please indicate how effective the new controls will be at bringing the overall level of risk to an acceptable level.  Consider both the existing controls and the additional controls."]
[]
[]
[]
{"$rows_left_out":48}
{"sheet":"Lists","index":4,"n_rows":291,"n_cols":13,"rows_kept":291,"cut":false,"hidden":false,"merged":[[35,7,50,10],[4,17,4,18]]}
["Location","ID"]
["UC Berkeley",1,null,"Yes"]
["UC San Francisco",2,null,"No"]
["UC Davis",3]
["UC Los Angeles",4,null,"Names"]
["UC Riverside",5,null,"Letters",null,null,null,null,null,null,null,"Maximum effectiveness",0.95]
{"$rows_left_out":286}
{"sheet":"Chart","index":5,"n_rows":16,"n_cols":2,"rows_kept":16,"cut":false,"hidden":false,"merged":[[12,1,12,2],[11,1,11,2],[2,1,9,2]]}
[]
[null,"Overview:"]
[null,"This chart is a graphical representation of the different types of risks identified during your assessment.  The larger the bubble, the higher the residual risk.  The closer the bubble moves to the upper-right hand corner of the graph, the higher the estimated impact and likelihood."]
[]
[]
[]
{"$rows_left_out":11}
{"sheet":"ChartData","index":6,"n_rows":46,"n_cols":14,"rows_kept":46,"cut":false,"hidden":false,"merged":[]}
["LabelChart","ImpactChart","LikeChart","Rating","Letter","RiskName","ImpactNoControls","LikeNoControls","Controls","ImpactControls","LikeControls","Added","ImpactAdded","LikeAdded"]
[{"$f":"IF(Assess!C9=\"\",\"\",IF(Assess!J9=\"No\",\"\",IF(Chart!$B$16=\"Letters\",E2,F2)))","v":"A"},{"$f":"IF(Assess!C9=\"\",\"\",IF(Assess!J9=\"No\",\"\",IF(Chart!$B$13=Lists!$D$13,G2,IF(G2=J2,G2,IF(Chart!$B$13=Lists!$D$14,IF(M2=\"\",\"\",G2-J2),G2-M2)))))","v":8.4},{"$f":"IF(Assess!E9=\"\",\"\",IF(Assess!K9=\"No\",\"\",IF(Chart!$B$13=Lists!$D$13,H2,IF(H2=K2,H2,IF(Chart!$B$13=Lists!$D$14,H2-K2,H2-N2)))))","v":4.2},{"$f":"IF(Assess!C9=\"\",\"\",IF(Assess!J9=\"No\",\"\",SUM(B2:C2)))","v":12.600000000000001},{"$f":"IF(Assess!B9=\"\",\"\",IF(Assess!J9=\"No\",\"\",Assess!B9))","v":"A"},{"$f":"IF(Assess!C9=\"\",\"\",IF(Assess!J9=\"No\",\"\",Assess!C9))","v":"Students contract vaccine preventable diseases: Yellow Fever, Hepatitis A & B, Typhoid, Meningococcal (Meningitis), Rabies, Polio"},{"$f":"IF(Assess!L9=\"\",\"\",IF(Assess!J9=\"No\",\"\",Assess!L9))","v":12},{"$f":"IF(Assess!M9=\"\",\"\",IF(Assess!J9=\"No\",\"\",Assess!M9))","v":6},{"$f":"IF(Assess!J9=\"No\",\"\",IF(Assess!N9=\"\",1,Assess!N9))","v":0.3},{"$f":"IF(I2=\"\",\"\",IF(G2=\"\",\"\",I2*G2))","v":3.5999999999999996},{"$f":"IF(I2=\"\",\"\",IF(H2=\"\",\"\",I2*H2))","v":1.7999999999999998},{"$f":"IF(Assess!J9=\"No\",\"\",IF(Assess2!O9=\"\",I2,Assess2!O9))","v":0.92999999999999994},{"$f":"IF(L2=\"\",\"\",IF(G2=\"\",\"\",L2*G2))","v":11.16},{"$f":"IF(L2=\"\",\"\",IF(H2=\"\",\"\",L2*H2))","v":5.58}]
[{"$f":"IF(Assess!C10=\"\",\"\",IF(Assess!J10=\"No\",\"\",IF(Chart!$B$16=\"Letters\",E3,F3)))","v":"B"},{"$f":"IF(Assess!C10=\"\",\"\",IF(Assess!J10=\"No\",\"\",IF(Chart!$B$13=Lists!$D$13,G3,IF(G3=J3,G3,IF(Chart!$B$13=Lists!$D$14,IF(M3=\"\",\"\",G3-J3),G3-M3)))))","v":4.8000000000000007},{"$f":"IF(Assess!E10=\"\",\"\",IF(Assess!K10=\"No\",\"\",IF(Chart!$B$13=Lists!$D$13,H3,IF(H3=K3,H3,IF(Chart!$B$13=Lists!$D$14,H3-K3,H3-N3)))))","v":2.4000000000000004},{"$f":"IF(Assess!C10=\"\",\"\",IF(Assess!J10=\"No\",\"\",SUM(B3:C3)))","v":7.2000000000000011},{"$f":"IF(Assess!B10=\"\",\"\",IF(Assess!J10=\"No\",\"\",Assess!B10))","v":"B"},{"$f":"IF(Assess!C10=\"\",\"\",IF(Assess!J10=\"No\",\"\",Assess!C10))","v":"Meningitis - Students with risk factors for Meningitis (poor overall health, prior infection, birth defect in the skull, a head injury or brain surgery, previous infections such as upper respiratory or Lyme disease, cochlear implant; impaired immune system"},{"$f":"IF(Assess!L10=\"\",\"\",IF(Assess!J10=\"No\",\"\",Assess!L10))","v":12},{"$f":"IF(Assess!M10=\"\",\"\",IF(Assess!J10=\"No\",\"\",Assess!M10))","v":6},{"$f":"IF(Assess!J10=\"No\",\"\",IF(Assess!N10=\"\",1,Assess!N10))","v":0.6},{"$f":"IF(I3=\"\",\"\",IF(G3=\"\",\"\",I3*G3))","v":7.1999999999999993},{"$f":"IF(I3=\"\",\"\",IF(H3=\"\",\"\",I3*H3))","v":3.5999999999999996},{"$f":"IF(Assess!J10=\"No\",\"\",IF(Assess2!O10=\"\",I3,Assess2!O10))","v":0.9},{"$f":"IF(L3=\"\",\"\",IF(G3=\"\",\"\",L3*G3))","v":10.8},{"$f":"IF(L3=\"\",\"\",IF(H3=\"\",\"\",L3*H3))","v":5.4}]
[{"$f":"IF(Assess!C11=\"\",\"\",IF(Assess!J11=\"No\",\"\",IF(Chart!$B$16=\"Letters\",E4,F4)))","v":"C"},{"$f":"IF(Assess!C11=\"\",\"\",IF(Assess!J11=\"No\",\"\",IF(Chart!$B$13=Lists!$D$13,G4,IF(G4=J4,G4,IF(Chart!$B$13=Lists!$D$14,IF(M4=\"\",\"\",G4-J4),G4-M4)))))","v":3.75},{"$f":"IF(Assess!E11=\"\",\"\",IF(Assess!K11=\"No\",\"\",IF(Chart!$B$13=Lists!$D$13,H4,IF(H4=K4,H4,IF(Chart!$B$13=Lists!$D$14,H4-K4,H4-N4)))))","v":2.5},{"$f":"IF(Assess!C11=\"\",\"\",IF(Assess!J11=\"No\",\"\",SUM(B4:C4)))","v":6.25},{"$f":"IF(Assess!B11=\"\",\"\",IF(Assess!J11=\"No\",\"\",Assess!B11))","v":"C"},{"$f":"IF(Assess!C11=\"\",\"\",IF(Assess!J11=\"No\",\"\",Assess!C11))","v":"Malaria - Students with risk factors for Malaria (stopping or not adhering to prophylaxis, not taking personal protective measures, using substandard drugs purchased over seas, not follow-up if symptoms occur)"},{"$f":"IF(Assess!L11=\"\",\"\",IF(Assess!J11=\"No\",\"\",Assess!L11))","v":15},{"$f":"IF(Assess!M11=\"\",\"\",IF(Assess!J11=\"No\",\"\",Assess!M11))","v":10},{"$f":"IF(Assess!J11=\"No\",\"\",IF(Assess!N11=\"\",1,Assess!N11))","v":0.75},11.25,7.5,{"$f":"IF(Assess!J11=\"No\",\"\",IF(Assess2!O11=\"\",I4,Assess2!O11))","v":0.75},11.25,7.5]
[{"$f":"IF(Assess!C12=\"\",\"\",IF(Assess!J12=\"No\",\"\",IF(Chart!$B$16=\"Letters\",E5,F5)))","v":"D"},{"$f":"IF(Assess!C12=\"\",\"\",IF(Assess!J12=\"No\",\"\",IF(Chart!$B$13=Lists!$D$13,G5,IF(G5=J5,G5,IF(Chart!$B$13=Lists!$D$14,IF(M5=\"\",\"\",G5-J5),G5-M5)))))","v":3.75},{"$f":"IF(Assess!E12=\"\",\"\",IF(Assess!K12=\"No\",\"\",IF(Chart!$B$13=Lists!$D$13,H5,IF(H5=K5,H5,IF(Chart!$B$13=Lists!$D$14,H5-K5,H5-N5)))))","v":2.5},{"$f":"IF(Assess!C12=\"\",\"\",IF(Assess!J12=\"No\",\"\",SUM(B5:C5)))","v":6.25},{"$f":"IF(Assess!B12=\"\",\"\",IF(Assess!J12=\"No\",\"\",Assess!B12))","v":"D"},{"$f":"IF(Assess!C12=\"\",\"\",IF(Assess!J12=\"No\",\"\",Assess!C12))","v":"Parasitic Infection - Students contract parasitic infections (consuming or exposure to contaminated water by drinking, swimming or bathing) for which no vaccines or preventive drugs are available"},{"$f":"IF(Assess!L12=\"\",\"\",IF(Assess!J12=\"No\",\"\",Assess!L12))","v":15},{"$f":"IF(Assess!M12=\"\",\"\",IF(Assess!J12=\"No\",\"\",Assess!M12))","v":10},{"$f":"IF(Assess!J12=\"No\",\"\",IF(Assess!N12=\"\",1,Assess!N12))","v":0.75},11.25,7.5,{"$f":"IF(Assess!J12=\"No\",\"\",IF(Assess2!O12=\"\",I5,Assess2!O12))","v":0.75},11.25,7.5]
[{"$f":"IF(Assess!C13=\"\",\"\",IF(Assess!J13=\"No\",\"\",IF(Chart!$B$16=\"Letters\",E6,F6)))","v":"E"},{"$f":"IF(Assess!C13=\"\",\"\",IF(Assess!J13=\"No\",\"\",IF(Chart!$B$13=Lists!$D$13,G6,IF(G6=J6,G6,IF(Chart!$B$13=Lists!$D$14,IF(M6=\"\",\"\",G6-J6),G6-M6)))))","v":3.75},{"$f":"IF(Assess!E13=\"\",\"\",IF(Assess!K13=\"No\",\"\",IF(Chart!$B$13=Lists!$D$13,H6,IF(H6=K6,H6,IF(Chart!$B$13=Lists!$D$14,H6-K6,H6-N6)))))","v":1.5},{"$f":"IF(Assess!C13=\"\",\"\",IF(Assess!J13=\"No\",\"\",SUM(B6:C6)))","v":5.25},{"$f":"IF(Assess!B13=\"\",\"\",IF(Assess!J13=\"No\",\"\",Assess!B13))","v":"E"},{"$f":"IF(Assess!C13=\"\",\"\",IF(Assess!J13=\"No\",\"\",Assess!C13))","v":"Rabies - a preventable and acute viral disease of the central nervous system, most often transmitted through the bite of a rabid animal."},{"$f":"IF(Assess!L13=\"\",\"\",IF(Assess!J13=\"No\",\"\",Assess!L13))","v":15},{"$f":"IF(Assess!M13=\"\",\"\",IF(Assess!J13=\"No\",\"\",Assess!M13))","v":6},{"$f":"IF(Assess!J13=\"No\",\"\",IF(Assess!N13=\"\",1,Assess!N13))","v":0.75},11.25,4.5,{"$f":"IF(Assess!J13=\"No\",\"\",IF(Assess2!O13=\"\",I6,Assess2!O13))","v":0.75},11.25,4.5]
{"$rows_left_out":41}
{"sheet":"Export","index":7,"n_rows":46,"n_cols":23,"rows_kept":46,"cut":false,"hidden":false,"merged":[]}
["Project Name","UC Location ID","Department/College","Person1","Person2","Person3","Person4","Date","Letter","RiskName","PotentialConsequences","ImpactNoControls","LikelihoodNoControls","RiskRatingNone","CurrentDescription","CurrentEffectiveness","RiskRatingCurrent","RiskRatingCurrentLanguage","AdditionalDescription","AdditionalEffectiveness","RiskRatingAdditional","RiskRatingAdditionalLanguage","ResponsiblePersonnel"]
[{"$f":"IF(Intro!$N$5=\"\",\"\",Intro!$N$5)","v":"Ines Detomana"},{"$f":"IF(Intro!$N$10=\"\",\"\",VLOOKUP(Intro!$N$10,Lists!$A$1:$B$19,2,FALSE))","v":16},{"$f":"IF(Intro!$N$11=\"\",\"\",Intro!$N$11)","v":"UC Education Abroad Program"},{"$f":"IF(Intro!$N$6=\"\",\"\",Intro!$N$6)","v":""},{"$f":"IF(Intro!$N$7=\"\",\"\",Intro!$N$7)","v":""},{"$f":"IF(Intro!$N$8=\"\",\"\",Intro!$N$8)","v":""},{"$f":"IF(Intro!$N$9=\"\",\"\",Intro!$N$9)","v":""},{"$f":"IF(Intro!$N$12=\"\",\"\",Intro!$N$12)","v":""},{"$f":"IF(Assess!B9=\"\",\"\",Assess!B9)","v":"A"},{"$f":"IF(Assess!C9=\"\",\"\",Assess!C9)","v":"Students contract vaccine preventable diseases: Yellow Fever, Hepatitis A & B, Typhoid, Meningococcal (Meningitis), Rabies, Polio"},{"$f":"IF(Assess!D9=\"\",\"\",Assess!D9)","v":"Loss of program benefits, serious illness, death"},{"$f":"IF(Assess!E9=\"\",\"\",Assess!E9)","v":"High"},{"$f":"IF(Assess!F9=\"\",\"\",Assess!F9)","v":"Moderate"},{"$f":"IF(Assess!L9=\"\",\"\",IF(Assess!M9=\"\",\"\",SUM(Assess!L9:M9)))","v":18},{"$f":"IF(Assess!G9=\"\",\"\",Assess!G9)","v":"Students expected to follow CDC vaccine recommendations"},{"$f":"IF(Assess!H9=\"\",\"\",Assess!H9)","v":"Minor"},{"$f":"IF(Assess!O9=\"\",\"\",Assess!O9)","v":12.6},{"$f":"IF(Assess!P9=\"\",\"\",Assess!P9)","v":"Under-controlled"},{"$f":"IF(Assess2!F9=\"\",\"\",Assess2!F9)","v":"1) Remind students to follow CDC vaccine recommendations before departure.  2) Get students authorization to speak to parents and send information to parents. 3) Emphasize with campus offices to mention malaria prevention and/or include someone from SH during pre-departure orientation. "},{"$f":"IF(Assess2!G9=\"\",\"\",Assess2!G9)","v":"Significant improvement"},{"$f":"Assess2!O9","v":0.92999999999999994},{"$f":"Assess2!H9","v":"Adequately controlled"},{"$f":"IF(Assess2!I9=\"\",\"\",Assess2!I9)","v":"Ines? Campus? Onsite? Students?--- Student's must choose to follow detailed advise."}]
[{"$f":"IF(Intro!$N$5=\"\",\"\",Intro!$N$5)","v":"Ines Detomana"},{"$f":"IF(Intro!$N$10=\"\",\"\",VLOOKUP(Intro!$N$10,Lists!$A$1:$B$19,2,FALSE))","v":16},{"$f":"IF(Intro!$N$11=\"\",\"\",Intro!$N$11)","v":"UC Education Abroad Program"},{"$f":"IF(Intro!$N$6=\"\",\"\",Intro!$N$6)","v":""},{"$f":"IF(Intro!$N$7=\"\",\"\",Intro!$N$7)","v":""},{"$f":"IF(Intro!$N$8=\"\",\"\",Intro!$N$8)","v":""},{"$f":"IF(Intro!$N$9=\"\",\"\",Intro!$N$9)","v":""},{"$f":"IF(Intro!$N$12=\"\",\"\",Intro!$N$12)","v":""},{"$f":"IF(Assess!B10=\"\",\"\",Assess!B10)","v":"B"},{"$f":"IF(Assess!C10=\"\",\"\",Assess!C10)","v":"Meningitis - Students with risk factors for Meningitis (poor overall health, prior infection, birth defect in the skull, a head injury or brain surgery, previous infections such as upper respiratory or Lyme disease, cochlear implant; impaired immune system"},{"$f":"IF(Assess!D10=\"\",\"\",Assess!D10)","v":"Serious illness (Meningococcal disease is an acute bacterial infection characterized by sudden onset with fever, intense headache, nausea, vomiting, stiff neck, and, frequently, a rash with pink spots)"},{"$f":"IF(Assess!E10=\"\",\"\",Assess!E10)","v":"High"},{"$f":"IF(Assess!F10=\"\",\"\",Assess!F10)","v":"Moderate"},{"$f":"IF(Assess!L10=\"\",\"\",IF(Assess!M10=\"\",\"\",SUM(Assess!L10:M10)))","v":18},{"$f":"IF(Assess!G10=\"\",\"\",Assess!G10)","v":"1) All EAP students are required to complete the online UCEAP Travel Health Certification course through MyEAP and strongly encouraged to follow through about vaccine recommendations with a travel health professional.  2) Avoid close human contact in crowded areas. 3) Frequent hand washing with soap and water."},{"$f":"IF(Assess!H10=\"\",\"\",Assess!H10)","v":"Moderate"},{"$f":"IF(Assess!O10=\"\",\"\",Assess!O10)","v":7.2},{"$f":"IF(Assess!P10=\"\",\"\",Assess!P10)","v":"Potentially under-controlled"},{"$f":"IF(Assess2!F10=\"\",\"\",Assess2!F10)","v":"1) Remind students to follow CDC vaccine recommendations before departure.  2) Get students authorization to speak to parents and send information to parents. 3) Emphasize with campus offices to mention malaria prevention and/or include someone from SH during pre-departure orientation. "},{"$f":"IF(Assess2!G10=\"\",\"\",Assess2!G10)","v":"Substantial improvement"},{"$f":"Assess2!O10","v":0.9},{"$f":"Assess2!H10","v":"Adequately controlled"},{"$f":"IF(Assess2!I10=\"\",\"\",Assess2!I10)","v":"Ines? Campus? Onsite? Students?--- Student's must choose to follow detailed advise."}]
[{"$f":"IF(Intro!$N$5=\"\",\"\",Intro!$N$5)","v":"Ines Detomana"},{"$f":"IF(Intro!$N$10=\"\",\"\",VLOOKUP(Intro!$N$10,Lists!$A$1:$B$19,2,FALSE))","v":16},{"$f":"IF(Intro!$N$11=\"\",\"\",Intro!$N$11)","v":"UC Education Abroad Program"},{"$f":"IF(Intro!$N$6=\"\",\"\",Intro!$N$6)","v":""},{"$f":"IF(Intro!$N$7=\"\",\"\",Intro!$N$7)","v":""},{"$f":"IF(Intro!$N$8=\"\",\"\",Intro!$N$8)","v":""},{"$f":"IF(Intro!$N$9=\"\",\"\",Intro!$N$9)","v":""},{"$f":"IF(Intro!$N$12=\"\",\"\",Intro!$N$12)","v":""},{"$f":"IF(Assess!B11=\"\",\"\",Assess!B11)","v":"C"},{"$f":"IF(Assess!C11=\"\",\"\",Assess!C11)","v":"Malaria - Students with risk factors for Malaria (stopping or not adhering to prophylaxis, not taking personal protective measures, using substandard drugs purchased over seas, not follow-up if symptoms occur)"},{"$f":"IF(Assess!D11=\"\",\"\",Assess!D11)","v":"Students could get critically sick, temporarily or permanently"},{"$f":"IF(Assess!E11=\"\",\"\",Assess!E11)","v":"Very high"},{"$f":"IF(Assess!F11=\"\",\"\",Assess!F11)","v":"Very high"},{"$f":"IF(Assess!L11=\"\",\"\",IF(Assess!M11=\"\",\"\",SUM(Assess!L11:M11)))","v":25},{"$f":"IF(Assess!G11=\"\",\"\",Assess!G11)","v":"Recommendations for prevention of malaria must be individualized.  1) Students are required to complete the UCEAP Online Travel Health Education Certification course and strongly recommended to meet with a travel health specialist after the course to understand the health risks, get necessary medication based on length of stay and current medical condition, and learn how diseases are transmitted.  2) Students advised to spray insecticide on walls; use a pyrethroid-containing flying-insect spray in living and sleeping areas; understand behaviors to minimize exposure to mosquitoes; wear barrier clothing; use insecticide-impregnated bed nets; spray residence; take an appropriate antimalarial drug regimen exactly as prescribed and carefully following antimosquito measures. 3) Students sign a mandatory Malaria Prophylaxis Agreement form. Students who do not comply may be dismissed.  3) EAP student health insurance provides adequate coverage and medical evacuation benefits. 4) UCEAP insurance coverage includes 100% coverage for prophylaxis.  5) Students told to continue taking the medication as recommended after leaving the malaria-risk area. "},{"$f":"IF(Assess!H11=\"\",\"\",Assess!H11)","v":"Substantial"},{"$f":"IF(Assess!O11=\"\",\"\",Assess!O11)","v":6.25},{"$f":"IF(Assess!P11=\"\",\"\",Assess!P11)","v":"Potentially under-controlled"},{"$f":"IF(Assess2!F11=\"\",\"\",Assess2!F11)","v":"1) Remind students to follow CDC vaccine recommendations before departure.  2) Get students authorization to speak to parents and send information to parents. 3) Emphasize with campus offices to mention malaria prevention and/or include someone from SH during pre-departure orientation. "},{"$f":"IF(Assess2!G11=\"\",\"\",Assess2!G11)","v":"No Change"},{"$f":"Assess2!O11","v":0.75},{"$f":"Assess2!H11","v":"Potentially under-controlled"},{"$f":"IF(Assess2!I11=\"\",\"\",Assess2!I11)","v":"Student Health Centers for those students who attend the UCEAP clearance on their UC campuses.  Can't reach private practitioners. Students?--- Student's must choose to follow detailed advise."}]
[{"$f":"IF(Intro!$N$5=\"\",\"\",Intro!$N$5)","v":"Ines Detomana"},{"$f":"IF(Intro!$N$10=\"\",\"\",VLOOKUP(Intro!$N$10,Lists!$A$1:$B$19,2,FALSE))","v":16},{"$f":"IF(Intro!$N$11=\"\",\"\",Intro!$N$11)","v":"UC Education Abroad Program"},{"$f":"IF(Intro!$N$6=\"\",\"\",Intro!$N$6)","v":""},{"$f":"IF(Intro!$N$7=\"\",\"\",Intro!$N$7)","v":""},{"$f":"IF(Intro!$N$8=\"\",\"\",Intro!$N$8)","v":""},{"$f":"IF(Intro!$N$9=\"\",\"\",Intro!$N$9)","v":""},{"$f":"IF(Intro!$N$12=\"\",\"\",Intro!$N$12)","v":""},{"$f":"IF(Assess!B12=\"\",\"\",Assess!B12)","v":"D"},{"$f":"IF(Assess!C12=\"\",\"\",Assess!C12)","v":"Parasitic Infection - Students contract parasitic infections (consuming or exposure to contaminated water by drinking, swimming or bathing) for which no vaccines or preventive drugs are available"},{"$f":"IF(Assess!D12=\"\",\"\",Assess!D12)","v":"Schistosoma parasites can penetrate the skin of persons who are wading, swimming, bathing, or washing in contaminated water. Within several weeks, worms grow inside the blood vessels of the body and produce eggs. Some of these eggs travel to the bladder or intestines and are passed into the urine or stool.  Occasionally, eggs may be deposited in the brain or spinal cord, leading to seizures or paralysis."},{"$f":"IF(Assess!E12=\"\",\"\",Assess!E12)","v":"Very high"},{"$f":"IF(Assess!F12=\"\",\"\",Assess!F12)","v":"Very high"},{"$f":"IF(Assess!L12=\"\",\"\",IF(Assess!M12=\"\",\"\",SUM(Assess!L12:M12)))","v":25},{"$f":"IF(Assess!G12=\"\",\"\",Assess!G12)","v":"Students advised to avoid 1) swimming or wading in freshwater; 2) drink safe water; either boil water for 1 minute or filter water before drinking. Iodine treatment alone WILL NOT GUARANTEE that water is safe and free of all parasites. 3) If a student accidentally come into contact with fresh water, vigorous towel drying after a very brief water exposure may help to prevent the Schistosoma parasite from penetrating the skin. Students should NOT rely on vigorous towel drying to prevent Schistosomiasis"},{"$f":"IF(Assess!H12=\"\",\"\",Assess!H12)","v":"Substantial"},{"$f":"IF(Assess!O12=\"\",\"\",Assess!O12)","v":6.25},{"$f":"IF(Assess!P12=\"\",\"\",Assess!P12)","v":"Potentially under-controlled"},{"$f":"IF(Assess2!F12=\"\",\"\",Assess2!F12)","v":""},{"$f":"IF(Assess2!G12=\"\",\"\",Assess2!G12)","v":"No Change"},{"$f":"Assess2!O12","v":0.75},{"$f":"Assess2!H12","v":"Potentially under-controlled"},{"$f":"IF(Assess2!I12=\"\",\"\",Assess2!I12)","v":"Student Health Centers for those students who attend the UCEAP clearance on their UC campuses.  Can't reach private practitioners. Student's must choose to follow detailed advise."}]
[{"$f":"IF(Intro!$N$5=\"\",\"\",Intro!$N$5)","v":"Ines Detomana"},{"$f":"IF(Intro!$N$10=\"\",\"\",VLOOKUP(Intro!$N$10,Lists!$A$1:$B$19,2,FALSE))","v":16},{"$f":"IF(Intro!$N$11=\"\",\"\",Intro!$N$11)","v":"UC Education Abroad Program"},{"$f":"IF(Intro!$N$6=\"\",\"\",Intro!$N$6)","v":""},{"$f":"IF(Intro!$N$7=\"\",\"\",Intro!$N$7)","v":""},{"$f":"IF(Intro!$N$8=\"\",\"\",Intro!$N$8)","v":""},{"$f":"IF(Intro!$N$9=\"\",\"\",Intro!$N$9)","v":""},{"$f":"IF(Intro!$N$12=\"\",\"\",Intro!$N$12)","v":""},{"$f":"IF(Assess!B13=\"\",\"\",Assess!B13)","v":"E"},{"$f":"IF(Assess!C13=\"\",\"\",Assess!C13)","v":"Rabies - a preventable and acute viral disease of the central nervous system, most often transmitted through the bite of a rabid animal."},{"$f":"IF(Assess!D13=\"\",\"\",Assess!D13)","v":"The disease is nearly always fatal when the person begins showing symptoms (fever, headache, agitation, anxiety, confusion, difficulty swallowing, excessive salivation, hydrophobia, hallucinations, insomnia and partial paralysis"},{"$f":"IF(Assess!E13=\"\",\"\",Assess!E13)","v":"Very high"},{"$f":"IF(Assess!F13=\"\",\"\",Assess!F13)","v":"Moderate"},{"$f":"IF(Assess!L13=\"\",\"\",IF(Assess!M13=\"\",\"\",SUM(Assess!L13:M13)))","v":21},{"$f":"IF(Assess!G13=\"\",\"\",Assess!G13)","v":"The risk of rabies in an encounter with an animal and the precautions necessary to prevent rabies are the same as they are in the United States.  Students are told to consult with a health care professional after the required UCEAP online Travel Health Education Certification course.  Consider getting a rabies vaccine if your activities will put you in contact with animals (approximately $160 at UC Student Health Services).  Avoid approaching any wild or domestic animals.  Avoid all contact with animals, especially stray dogs and cats.  If bitten or scratched, wash the wound immediately with soap and water (and povidone iodine, if available); seek medical attention immediately to determine if mediation or anti-rabies vaccine is needed. Immediate local treatment will substantially reduce the risk of rabies.  Treat any bite from a potentially rabid animal as a medical emergency."},{"$f":"IF(Assess!H13=\"\",\"\",Assess!H13)","v":"Substantial"},{"$f":"IF(Assess!O13=\"\",\"\",Assess!O13)","v":5.25},{"$f":"IF(Assess!P13=\"\",\"\",Assess!P13)","v":"Potentially under-controlled"},{"$f":"IF(Assess2!F13=\"\",\"\",Assess2!F13)","v":""},{"$f":"IF(Assess2!G13=\"\",\"\",Assess2!G13)","v":"No Change"},{"$f":"Assess2!O13","v":0.75},{"$f":"Assess2!H13","v":"Potentially under-controlled"},{"$f":"IF(Assess2!I13=\"\",\"\",Assess2!I13)","v":"Students?--- Student's must choose to follow detailed advise."}]
{"$rows_left_out":40}